{"text_format":"1","workbook":"xlsx","n_sheets":2,"sheets":["原紙","重量表 (旧)"],"not_rendered":{"charts":0,"images":1,"macros":1,"external_links":0,"defined_names":71,"comments":0,"pivot_tables":0},"unopened":[],"bounds":{"document_bytes":16777216,"sheet_cells":100000,"rows_first":2000,"rows_last":500,"rows_between":2000,"halvings":0,"cell_chars":16384,"cell_head_chars":4096},"cells_cut":0,"cells_raw":0,"read":"whole","date_system":"1900"}

{"sheet":"原紙","index":0,"n_rows":36,"n_cols":21,"rows_kept":36,"cut":false,"hidden":false,"merged":[[5,1,5,3],[5,4,5,20],[0,18,0,20],[3,1,3,3],[3,4,3,5],[3,6,3,12],[3,13,3,14],[3,15,3,20],[4,1,4,3],[4,4,4,5],[4,6,4,14],[4,15,4,16],[4,17,4,20],[0,6,0,13],[1,1,1,5],[6,1,6,3],[6,10,6,11],[6,12,6,13],[6,17,6,20],[7,1,7,3],[7,4,7,11],[7,12,7,16],[7,17,7,20],[8,1,8,3],[8,4,8,11],[8,12,8,20],[9,1,10,3],[9,4,9,11],[9,12,9,20],[10,4,10,11],[10,12,10,20],[11,2,11,6],[11,12,11,16],[12,2,12,6],[12,12,12,16],[13,2,13,6],[13,12,13,16],[14,2,14,6],[14,12,14,16],[15,2,15,6],[15,12,15,16],[16,2,16,6],[16,12,16,16],[17,2,17,6],[17,12,17,16],[18,2,18,6],[18,12,18,16],[19,2,19,6],[19,12,19,16],[20,2,20,6],[20,12,20,16],[21,2,21,6],[21,12,21,16],[22,2,22,6],[22,12,22,16],[28,12,28,16],[23,2,23,6],[23,12,23,16],[24,2,24,6],[24,12,24,16],[25,2,25,6],[25,12,25,16],[26,2,26,6],[26,12,26,16],[27,2,27,6],[27,12,27,16],[28,2,28,6],[35,20,36,20],[32,2,32,6],[32,12,32,16],[33,1,34,1],[33,2,33,16],[34,2,34,16],[35,1,36,5],[35,6,36,15],[35,16,36,17],[29,2,29,6],[29,12,29,16],[30,2,30,6],[30,12,30,16],[31,2,31,6],[31,12,31,16]]}
[null,null,null,null,null,null,"オ ー ダ ー 表"]
[null,"月/　　　　日"]
[]
[null,"会　社　名",null,null,null,null,null,null,null,null,null,null,null,"ＴＥＬ"]
[null,"現　場　名",null,null,null,null,null,null,null,null,null,null,null,null,null,"担当者"]
[null,"住　　　所",null,null,"〒　　　　　-"]
[null,"積　込　日",null,null,null,null,"／",null,null,null,"夜積み・当配",null,"納入日",null,null,"／",null,"AM・PM　   　："]
[null,"納入方法",null,null,"配　達　・　来　社　・　発　送　・　引　取",null,null,null,null,null,null,null,"運　賃　請　求",null,null,null,null,"可　 ・　 不可"]
[null,"運送店名",null,null,null,null,null,null,null,null,null,null,"発送　・　軽量　・　２ｔ ・ ４ｔ　・ ６ｔ　・　８ｔ"]
[null,"その他指示類",null,null,null,null,null,null,null,null,null,null,"１１ｔ　・　増ｔ　・　トレーラー　・　その他"]
[null,null,null,null,null,null,null,null,null,null,null,null,"ランク・値引率"]
[null,null,"品　名　・　品 番",null,null,null,null,"数　量","重　量","小　計","備考",null,"品　名　・　品　番",null,null,null,null,"数　量","重　量","小　計","備考"]
[null,1,null,null,null,null,null,null,{"$f":"IF(ISBLANK(#REF!),\"\",VLOOKUP(#REF!,#REF!,4,FALSE))","v":{"$error":"#REF!"}},{"$f":"IF(ISERROR(I13*H13),\"\",I13*H13)","v":""},null,22,null,null,null,null,null,null,{"$f":"IF(ISBLANK(#REF!),\"\",(VLOOKUP(#REF!,#REF!,4,FALSE)))","v":{"$error":"#REF!"}},{"$f":"IF(ISERROR(S13*R13),\"\",S13*R13)","v":""}]
[null,2,null,null,null,null,null,null,{"$f":"IF(ISBLANK(#REF!),\"\",VLOOKUP(#REF!,#REF!,4,FALSE))","v":{"$error":"#REF!"}},"",null,23,null,null,null,null,null,null,{"$f":"IF(ISBLANK(#REF!),\"\",(VLOOKUP(#REF!,#REF!,4,FALSE)))","v":{"$error":"#REF!"}},""]
[null,3,null,null,null,null,null,null,{"$f":"IF(ISBLANK(#REF!),\"\",VLOOKUP(#REF!,#REF!,4,FALSE))","v":{"$error":"#REF!"}},"",null,24,null,null,null,null,null,null,{"$f":"IF(ISBLANK(#REF!),\"\",(VLOOKUP(#REF!,#REF!,4,FALSE)))","v":{"$error":"#REF!"}},""]
[null,4,null,null,null,null,null,null,{"$f":"IF(ISBLANK(#REF!),\"\",VLOOKUP(#REF!,#REF!,4,FALSE))","v":{"$error":"#REF!"}},"",null,25,null,null,null,null,null,null,{"$f":"IF(ISBLANK(#REF!),\"\",(VLOOKUP(#REF!,#REF!,4,FALSE)))","v":{"$error":"#REF!"}},""]
[null,5,null,null,null,null,null,null,{"$f":"IF(ISBLANK(#REF!),\"\",VLOOKUP(#REF!,#REF!,4,FALSE))","v":{"$error":"#REF!"}},"",null,26,null,null,null,null,null,null,{"$f":"IF(ISBLANK(#REF!),\"\",(VLOOKUP(#REF!,#REF!,4,FALSE)))","v":{"$error":"#REF!"}},""]
[null,6,null,null,null,null,null,null,{"$f":"IF(ISBLANK(#REF!),\"\",VLOOKUP(#REF!,#REF!,4,FALSE))","v":{"$error":"#REF!"}},"",null,27,null,null,null,null,null,null,{"$f":"IF(ISBLANK(#REF!),\"\",(VLOOKUP(#REF!,#REF!,4,FALSE)))","v":{"$error":"#REF!"}},""]
[null,7,null,null,null,null,null,null,{"$f":"IF(ISBLANK(#REF!),\"\",VLOOKUP(#REF!,#REF!,4,FALSE))","v":{"$error":"#REF!"}},"",null,28,null,null,null,null,null,null,{"$f":"IF(ISBLANK(#REF!),\"\",(VLOOKUP(#REF!,#REF!,4,FALSE)))","v":{"$error":"#REF!"}},""]
[null,8,null,null,null,null,null,null,{"$f":"IF(ISBLANK(#REF!),\"\",VLOOKUP(#REF!,#REF!,4,FALSE))","v":{"$error":"#REF!"}},"",null,29,null,null,null,null,null,null,{"$f":"IF(ISBLANK(#REF!),\"\",(VLOOKUP(#REF!,#REF!,4,FALSE)))","v":{"$error":"#REF!"}},""]
[null,9,null,null,null,null,null,null,{"$f":"IF(ISBLANK(#REF!),\"\",VLOOKUP(#REF!,#REF!,4,FALSE))","v":{"$error":"#REF!"}},"",null,30,null,null,null,null,null,null,{"$f":"IF(ISBLANK(#REF!),\"\",(VLOOKUP(#REF!,#REF!,4,FALSE)))","v":{"$error":"#REF!"}},""]
[null,10,null,null,null,null,null,null,{"$f":"IF(ISBLANK(#REF!),\"\",VLOOKUP(#REF!,#REF!,4,FALSE))","v":{"$error":"#REF!"}},"",null,31,null,null,null,null,null,null,{"$f":"IF(ISBLANK(#REF!),\"\",(VLOOKUP(#REF!,#REF!,4,FALSE)))","v":{"$error":"#REF!"}},""]
[null,11,null,null,null,null,null,null,{"$f":"IF(ISBLANK(#REF!),\"\",VLOOKUP(#REF!,#REF!,4,FALSE))","v":{"$error":"#REF!"}},"",null,32,null,null,null,null,null,null,{"$f":"IF(ISBLANK(#REF!),\"\",(VLOOKUP(#REF!,#REF!,4,FALSE)))","v":{"$error":"#REF!"}},""]
[null,12,null,null,null,null,null,null,{"$f":"IF(ISBLANK(#REF!),\"\",VLOOKUP(#REF!,#REF!,4,FALSE))","v":{"$error":"#REF!"}},"",null,33,null,null,null,null,null,null,{"$f":"IF(ISBLANK(#REF!),\"\",(VLOOKUP(#REF!,#REF!,4,FALSE)))","v":{"$error":"#REF!"}},""]
[null,13,null,null,null,null,null,null,{"$f":"IF(ISBLANK(#REF!),\"\",VLOOKUP(#REF!,#REF!,4,FALSE))","v":{"$error":"#REF!"}},"",null,34,null,null,null,null,null,null,{"$f":"IF(ISBLANK(#REF!),\"\",(VLOOKUP(#REF!,#REF!,4,FALSE)))","v":{"$error":"#REF!"}},""]
[null,14,null,null,null,null,null,null,{"$f":"IF(ISBLANK(#REF!),\"\",VLOOKUP(#REF!,#REF!,4,FALSE))","v":{"$error":"#REF!"}},"",null,35,null,null,null,null,null,null,{"$f":"IF(ISBLANK(#REF!),\"\",(VLOOKUP(#REF!,#REF!,4,FALSE)))","v":{"$error":"#REF!"}},""]
[null,15,null,null,null,null,null,null,{"$f":"IF(ISBLANK(#REF!),\"\",VLOOKUP(#REF!,#REF!,4,FALSE))","v":{"$error":"#REF!"}},"",null,36,null,null,null,null,null,null,{"$f":"IF(ISBLANK(#REF!),\"\",(VLOOKUP(#REF!,#REF!,4,FALSE)))","v":{"$error":"#REF!"}},""]
[null,16,null,null,null,null,null,null,{"$f":"IF(ISBLANK(#REF!),\"\",VLOOKUP(#REF!,#REF!,4,FALSE))","v":{"$error":"#REF!"}},"",null,37,null,null,null,null,null,null,{"$f":"IF(ISBLANK(#REF!),\"\",(VLOOKUP(#REF!,#REF!,4,FALSE)))","v":{"$error":"#REF!"}},""]
[null,17,null,null,null,null,null,null,{"$f":"IF(ISBLANK(#REF!),\"\",VLOOKUP(#REF!,#REF!,4,FALSE))","v":{"$error":"#REF!"}},"",null,38,null,null,null,null,null,null,{"$f":"IF(ISBLANK(#REF!),\"\",(VLOOKUP(#REF!,#REF!,4,FALSE)))","v":{"$error":"#REF!"}},""]
[null,18,null,null,null,null,null,null,{"$f":"IF(ISBLANK(#REF!),\"\",VLOOKUP(#REF!,#REF!,4,FALSE))","v":{"$error":"#REF!"}},"",null,39,null,null,null,null,null,null,{"$f":"IF(ISBLANK(#REF!),\"\",(VLOOKUP(#REF!,#REF!,4,FALSE)))","v":{"$error":"#REF!"}},""]
{"$rows_left_out":7}
{"sheet":"重量表 (旧)","index":1,"n_rows":99,"n_cols":68,"rows_kept":99,"cut":false,"hidden":true,"merged":[]}
[]
[]
["コード","品番","品名","重量","コード","品番","品名","重量","コード","品番","品名","重量","コード","品番","品名","重量","コード","品番","品名","重量","コード","品番","品名","重量","コード","品番","品名","重量","コード","品番","品名","重量","コード","品番","品名","重量","コード","品番","品名","重量","コード","品番","品名","重量","コード","品番","品名","重量","コード","品番","品名","重量","コード","品番","品名","重量","コード","品番","品名","重量","コード","品番","品名","重量","コード","品番","品名","重量"]
[1,"A4064","鳥居型建枠",17.2,97,"A151","梁渡（７６２用）",6.1,235,"OA-2306A09","SKバンノー受L09",null,338,null,null,null,471,"PNF-15L","スカイフェンス15",7.6,1054,"CG6-12ｶﾌﾟﾗ","妻側手摺 ｴﾝﾄﾞｽﾄｯﾊﾟｰ",2.5,2036,"60K6.0M","角パイプ６０",24.4,3010,"20ｶﾞﾀ","サポート２尺616-945mm",6,3141,"OKSKJ-6040","ＯＫ壁当てジャッキ",3.3,4049,"1ｶﾞﾀM80H","吊足場片面",0,null,null,null,null,6040,"ｶﾌﾟﾗｰ","ﾌﾞﾗｹｯﾄ先端ｸﾗﾝﾌﾟ",0.39,6263,"ALHTR6","ハッチ布板（アルミ）",null,6356,"ﾊﾟｯｶｰ25","２５φ用パッカー",null,7229,"H150-1.37M","Ｈ型鋼１．３７ｍ",43.16,9000,"SP-10L","キリバリサポート"]
[2,"A4055B","1219建枠 H1700",15.4,98,"A152","梁渡（９１４用）",6.5,236,"OA-2306D09","SKバンンー受C09",null,339,null,null,null,472,"PNF-12L","スカイフェンス12",6.4,1055,"CG800CＫ","妻手摺クランプ式",2.5,2037,"60K6.5M","角パイプ６０",26.4,3011,"15ｶﾞﾀ","サポート１．５尺404-623mm",5,3142,"OKSW-18","荷重受梁",17.399999999999999,4052,"TAC","吊足場クランプ",5,5114,"R3x6NB","ラッセルネット青",5.4,6041,"BKH1306","ブラケット",35,6264,"ﾂﾘｻｹﾞｻﾞｲ","階段枠吊り下げ材",null,6400,"AHG45","ＡＬキャスターゲート",44.5,7230,"H150-1.1M","Ｈ型鋼",34.65,9001,"SP-6L","キリバリサポート",12]
[3,"A405","1219調整枠 Ｈ1524",15.1,99,"A153","梁渡（６１０用）",5.6,237,"OA-2306B09","SKバンノー押え09",null,340,"FBH-305","張出ブラケット３０５",2,473,"PNF-09L","スカイフェンス09",5.0999999999999996,1056,"CG800C","妻手摺クランプ付",2.4,2038,"60K7.0M","角パイプ６０",28.4,3012,"10ｶﾞﾀ","サポート１尺315-445mm",4.5,3143,"OKSW-15","荷重受梁",15.8,null,null,null,null,5115,"R5x5NB","ラッセルネット青",7.5,6042,"BKH1606","ブラケット",60,6265,"LS-1010","斜面ノリダー本体",26,6401,"AHG-C1","ゲートクランプ　１",null,7231,"H150-1.0M","Ｈ型鋼１．０ｍ",31.5,9002,"A728","キャスター",4.8,9446,"GB","ゴムバンド中古"]
[4,"A405L","梯子型建枠",15.8,100,null,null,null,238,"OA-2306C09","SKフレ止め09",null,341,"FBH-24","張出ブラケット４０６",2.2000000000000002,474,"PNF-06L","スカイフェンス06",3.7,1057,"CG800","妻手摺",2.4,2039,"60K7.5M","角パイプ６０",30.5,3016,"E5ｶﾞﾀ","補助サポート（５尺）",5.5,3144,"OKSW-12","荷重受梁",12,4060,"BPﾊﾟﾚｯﾄ","防音パネルパレット",null,5116,"R6x6NB","ラッセルネット青",10.8,6043,"NKB300","伸縮ブラケット230-340mm",3.2,6266,"LSD-9","斜面ノリダー手摺",4,6402,"AHG-C2","ゲートクランプ　２",null,7232,"H150-1.5M","Ｈ型鋼１．５ｍ",47.25,9003,"AX11-14ｶﾞﾀ","ホリービーム",11.3,9447,"ﾊﾟﾚｯﾄM","メタルパレット"]
[5,"A404L","1219調整枠 Ｈ1219",12.9,101,"A1453","隅梁受金具",3.3,239,"OA-2306A06","SKバンノー受L06",null,342,"FBH-50","張出ブラケット６１０",2.9,null,null,null,null,1058,"CG600(C)","妻手摺",2,2040,"60K8.0M","角パイプ６０",32.5,3017,"E4ｶﾞﾀ","補助サポート（４尺）",4.7,3145,"OKSW-9","荷重受梁",10.4,4061,"BP06","防音パネル０６",5.2,5117,"R5x10NB","ラッセルネット青",15,6044,"ｶﾌﾟﾗ-300ﾖｳ","先端クランプ３００用",0.39,6269,"ｼｰﾄﾊﾟｲﾙ　3M","鋼矢板２型　３M",null,6403,"AHG-C3","ゲートクランプ　３",0.7,7233,"H150-2.0M","Ｈ型鋼２．０ｍ",63,9004,"AX14-18ｶﾞﾀ","ホリービーム",12.5,9452,"60K1.2M","角パイプ",4.87]
[6,"A403L","1219調整枠 H914",9.3000000000000007,102,"A1471","方杖（3ｽﾊﾟﾝ～用）",7.3,240,"OA-2306D06","SKバンノー受C06",null,343,"FSB-500","Ｆ伸縮ブラケット５０",3.1,490,"CAF-K6A","アルミ台車6輪",25.7,1059,"CG600C・ＯＳ","妻手摺",2,2045,"100K0.75M","角パイプ100",7.14,3018,"E3ｶﾞﾀ","補助サポート（３尺）",4.8,3146,"OKSR-1708","荷重受梁",28,4062,"BP18","防音パネル1800",9.5,5118,"R8x8NB","ラッセルネット青",19.2,6045,"ＱＢ６２４","クイックボード",8.5,6270,"ｼｰﾄﾊﾟｲﾙ　4M","鋼矢板２型　４M",null,6404,"AHG-45-ｱﾙﾏ","アルミクロスゲート",79,7234,"H150-2.5M","Ｈ型鋼２．５ｍ",null,9005,"AX18-25ｶﾞﾀ","ホリービーム",19,9460,"1.0M　（打）","1.0M打ち込み",2.73]
[7,"A417","1219調整枠 H490",8.9,103,"A1475","方杖（2ｽﾊﾟﾝ用）",5.7,241,"OA-2306B06","SKバンノー押え06",null,344,"FSB-750","Ｆ伸縮ブラケット７５",4.7,null,null,null,null,1060,"CG800C・ＯＳ","妻手摺９１４用",2.4,2046,"100K1.0M","角パイプ100",9.52,3021,"PNC","根がらみクランプ",1.6,3147,"OKS-1108","荷重受梁",21,4063,"BPｺｰﾅｰ","防音パネルコーナー",2.2000000000000002,5119,"R4x7NB","ラッセルネット青（透明）",9.3000000000000007,6046,"ＱＢＣ","クイッククランプ",1.9,6271,"ｼｰﾄﾊﾟｲﾙ　6M","鋼矢板２型　６M",null,6405,"AHG-60-ｱﾙﾏ","アルミクロスゲート",null,7235,"H150-3.0M","Ｈ型鋼３．０ｍ",93.3,9006,"AX25-32ｶﾞﾀ","ホリービーム",23,9461,"1.5M　（打）","1.５M打ち込み",4.0999999999999996]
[8,"A4025L","梯子型建枠",10.3,104,"ｶｼﾞｭｳｳｹﾊﾘ","荷重受梁",21.3,242,"OA-2306C06","SKフレ止め06",null,345,"FSB-1000","Ｆ伸縮ブラケット１０",5.8,500,"JFT-2.25","48.6支柱0225",1.3,1061,"A75","棒ジャッキ",4.0999999999999996,2047,"100K1.5M","角パイプ100",14.3,3022,"ALCH38","アルミ強力サポート",null,3148,"OKEC1","ＯＫ専用クランプ直交",1.1000000000000001,4064,"ﾐﾂﾂﾞﾒｸﾗﾝﾌﾟ","三爪クランプ",0.5,5120,"R7x7NB","ラッセルネット青（橙）",15.5,6049,"AL1750S","アングルブラケット",null,6272,"ｼｰﾄﾊﾟｲﾙ　8M","鋼矢板２型　８M",null,6406,"AXG-27","アルミゲート２．７ｍ",52,null,null,null,null,9007,"AX32-39ｶﾞﾀ","ホリービーム",28,0,0,0]
[9,null,null,null,105,"A149(M)","梁枠４スパン分割式L=7600",56,null,null,null,null,346,"FB-24","Ｆブラケット２４",1.8,503,"JFT-13.5","48.6支柱1350",5,1062,"A752","ジャッキベース",3.3,2048,"100K2.0M","角パイプ100",19.100000000000001,3023,"102.5×48.6","上管用直交",null,3149,"OKEC2","ＯＫ専用クランプ自在",1.1000000000000001,4065,"BP15","防音パネル1500",8.3000000000000007,null,null,null,null,null,null,null,null,null,null,null,null,6407,"AXG-36","アルミゲート３．６ｍ",65,7237,"H150-4.0M","Ｈ型鋼４．０ｍ",124.4,9008,"AX39-46ｶﾞﾀ","ホリービーム",35]
[10,null,null,null,106,"A1453-06","隅梁受金具",2.7,246,"SL35-14","スーパーラダー",null,347,"FB-50","Ｆブラケット５０",3.6,504,"JFT-18","48.6支柱1800",6.1,1063,"A752S","ロングジャッキベース",4.5999999999999996,2049,"100K2.5M","角パイプ100",23.8,3024,"120×48.6","下管用直交",null,3150,"OKSISJJ-125","移動用ジャッキ車輪（Ａ）",null,4066,"1219ﾂﾏｶﾞﾜ","コーナー防音1219",0,null,null,null,null,6050,"AL1750","アングルブラケット",60,null,null,null,null,6408,"AHG-P","ゲート用パネル",10,null,null,null,null,9009,"ｷｬｯﾁｸﾗﾝﾌﾟ","ﾏﾙﾁｷｬｯﾁｸﾗﾝﾌﾟ",1.3]
[11,"A3055A","914建枠 H1700",13.1,107,"A8030","布枠",0,247,"SL35-12","スーパーラダー",null,348,null,null,null,505,"JFT-27","48.6支柱2700",9.3000000000000007,1064,"A752H","大引受ジャッキ",4.5999999999999996,2050,"100K3.0M","角パイプ100",28.6,3026,"MSI120","ミドルサポート上管",19.5,3151,"OKSIS-48","移動用支持材（Ａ）",null,4067,"BP12","防音パネル1200",8.8000000000000007,null,null,null,null,6053,"NREｶﾞﾀM","スタンション（Ｍ）",7.1,6273,"PARAPET","パラペット手摺",8.6999999999999993,6409,"AHG-P1","パネル用セットピン",0,7239,"H150-5.0M","Ｈ型鋼５．０ｍ",null,9010]
[12,"A305","914調整枠 H1524",13,108,"A8040","布枠",13.2,248,"SL24-12","スーパーラダー",null,349,null,null,null,506,"JFT-36","48.6支柱3600",11.8,1065,"A752HS","ロング大引受ジャッキ",6.6,2051,"100K3.5M","角パイプ100",33.299999999999997,3027,"MSI80","ミドルサポート上管",13.1,3152,"ＯＫｽｷﾏｲﾀ８１","ＯＫｽｷﾏｲﾀ８１",6.5,4068,"BP09","防音パネル900",6.9,null,null,null,null,6054,"Hｶﾞﾀ",null,null,6274,"KSYA","ＫＳ傾斜足場",7,6410,"AXG-45","アルミゲート４．５ｍ",79,null,null,null,null,9011]
[13,"A304L","914調整枠 H1219",10,112,"A726","キャスター",4,249,"ﾗﾀﾞｰﾂﾘｶﾅｸﾞ","ラダー吊金具",null,350,"FG-3658","梁枠３６５８",21.6,508,"JFT-4.5HV","支柱0450脱着式",1.9,1066,"A753H","大引受ジャッキ",5.0999999999999996,2052,"100K4.0M","角パイプ100",38.1,3028,"MSI50","ミドルサポート上管",8.9,3153,"ＯＫｽｷﾏｲﾀ１１０","ＯＫｽｷﾏｲﾀ１１０",8.5,4069,"ﾌﾟﾙｺﾑ18","透明養生パネル",11.4,null,null,null,null,6055,"SEPAN","折半支柱",2.5,6276,"AL8MS","アルミ２連梯子８M",24,6411,"AXG-54","アルミゲート５．４ｍ",92,7241,"H150-6.0M","Ｈ型鋼６．０ｍ",189,9012,"ﾏﾙﾁﾊﾟﾚｯﾄ","マルチパレット"]
[14,"A303L","914調整枠 H914",8.5,116,"A728Jｼﾛ","ジャッキキャスター白",7.4,250,"HSH-143","ハンガーステージ梁材",9.1999999999999993,351,"FG-5487","梁枠５４８７",36.200000000000003,509,"JFT-09HV","支柱0900脱着式",3.3,1067,"A753HS","大引受ジャッキ",8.5,2053,"100K4.5M","角パイプ100",42.8,3029,"MSI30","ミドルサポート上管",5.9,3154,"ＯＫｽｷﾏｲﾀ１８０","ＯＫｽｷﾏｲﾀ１８０",12.3,4070,"ﾌﾟﾙｺﾑ09","透明養生パネル",0,5133,"06x2K防音","防音シート０６",4.0999999999999996,6056,"SEPAN-B","折半ベース",9,null,null,null,null,6412,"AXG-63","アルミゲート６．３ｍ",105,7242,"I150-1.1M","Ｈ型鋼150ｘ75",14.94,9013,"R0707N","ラッセルネット"]
[15,"A317","914調整枠 H490",7.5,117,"A726J","ジャッキキャスター",5.69,251,"HSS-143","ハンガーステージ斜材",12.2,352,null,null,null,510,"JFN-02","手摺0200",0.9,1068,"PKB","固定ベース",0.8,2054,"100K5.0M","角パイプ100",47.6,3030,"MSI20","ミドルサポート上管",4.3,3155,"ＯＫ－ＦＳＰＲＫ","ＯＫ用先行手摺金具",null,4071,"1K×2K","防音シート",9.8000000000000007,5134,"09x2K防音","防音シート０９",5.6,6060,"H2ｶﾞﾀ","スタンションＨ２型",6.2,null,null,null,null,6413,"ｶﾀﾋﾞﾗｷｶﾅｸﾞ","アルマゲート片開金具",0.5,7243,"I150-1.37M","Ｈ型鋼150ｘ75",19.18,9014,"SX48","軽量ビーム４８",32.5]
[16,null,null,null,118,"A728J","ジャッキキャスター",7.39,252,"HSW-143","ハンガーステージ手摺枠",9.6999999999999993,353,null,null,null,511,"JFN-03","手摺0305",1.2,1069,"A15","固定ベース",1,2055,"100K5.5M","角パイプ100",52.4,3031,"MSO120","ミドルサポート下管",20,3156,"60.5ﾍﾞｰｽ","ＯＫ固定ﾍﾞｰｽ",0.9,4072,"ﾌﾟﾙｺﾑ12","透明養生パネル",null,5135,"12x2K防音","防音シート１２",7.1,6061,"KSH2034","ハンドレール階段用",15.3,null,null,null,null,null,null,null,null,null,null,null,null,9015]
[17,null,null,null,119,"EJ32","伸縮ジャッキ",1.7,253,"HSRT-1","ハンガー幅木１８Ｆ",9.3000000000000007,354,null,null,null,512,"JFN-06","手摺0610",2,1070,"A15H","大引受金具",2.5,2056,"100K6.0M","角パイプ100",57.1,3032,"MSO80","ミドルサポート下管",14.4,3157,"OKS-PJ752H","OKS大引受ピポット",6,4073,"ﾌﾟﾙｺﾑ15","透明養生パネル",null,5136,"15x2K防音","防音シート１５",8.6,6062,"KPH1118","ハンドレール踊り場用",11.9,null,null,null,null,null,null,null,null,null,null,null,null,9016]
[18,null,null,null,120,"CC42","連結クランプ",0.5,254,"HSRT143","ハンガー幅木143",6.3,355,null,null,null,513,"JFN-09","手摺0914",2.7,1071,"A14P","ピポットジャッキ",4.0999999999999996,2057,"100K6.5M","角パイプ100",61.86,3033,"MSO50","ミドルサポート下管",12.1,3177,"OKC-4","センタートラス４３０",null,null,null,null,null,5137,"1K×2K防音","防音シート",9.8000000000000007,6063,"KPH0005","ハンドレール踊り場用",5.2,6277,"LH-36B","イージークライマー大",4.3,null,null,null,null,null,null,null,null,9017]
[19,null,null,null,121,"L500","アウトリガー控枠",9.1,255,"HSA25","ハンガーステージ手摺柱",2.6,356,null,null,null,514,"JFN-12","手摺1219",3.5,1074,"Uﾍﾞｰｽ","建枠上ベース",0.8,2058,"100K7.0M","角パイプ100",66.599999999999994,3034,"MSO30","ミドルサポート下管",9.4,3178,"OKC-8","センタートラス８３０",null,4080,"SXBP18","採光防音パネル18",10.7,5138,"1.82x2K","防音シート(インチ)",9.8000000000000007,6064,"KPH0812","ハンドレール踊り場用",10.5,6278,"AL3M","アルミ梯子３Ｍ",8,null,null,null,null,null,null,null,null,9018]
[20,"A6117R","簡易枠（ア－チ）",11.8,122,"ﾊﾊﾞｷA-RT1","幅木",4.0999999999999996,null,null,null,null,357,null,null,null,515,"JFN-15","手摺1524",4.3,1076,"PJ12","ピポットジャッキ",3.6,2059,"100K7.5M","角パイプ100",71.400000000000006,3035,"MSO20","ミドルサポート下管",7.5,3179,"OKS-2","スペーストラス",null,4081,"SXBP15","採光防音パネル15",8.9,5140,"WA13","白シート（耳付き）",null,6065,"KSH1219","ハンドレール階段用",12.5,6279,"ALHCKP","アルミ梯子クランプ",0.5,6500,"ｳﾜﾔﾊﾟﾈﾙ４ｍ","上屋パネル４Ｍ",390,null,null,null,null,9019,3018,"メタルホーム",16.899999999999999]
[21,"A6155A","鳥居型建枠",11.8,123,"ALHT-N3","アルミハッチ付布板",8.5,null,null,null,null,358,null,null,null,516,"JFN-18","手摺1829",5,1077,"PJ14","ピポットジャッキ",4.5,2060,"100K8.0M","角パイプ100",61.9,3038,"MSI1C","Ｍサポート用クランプ",1.7,3180,"OKE-4","エンドトラスＬ３６５",null,4082,"SXBP12","採光防音パネル12",7.1,5145,"BM1851G","メッシュシート",5.3,6066,"CB1","キャッチベース",8.5,6280,"AL4M","アルミ梯子４Ｍ",10.4,6501,"ｳﾜﾔﾊﾟﾈﾙ８ｍ","上屋パネル８Ｍ",768,null,null,null,null,9020,3015,"メタルホーム",14.2]
[22,"A6117S","610建枠 H1700",11.8,124,"ALHT-N4","アルミハッチ付布板",9.6999999999999993,260,"ALAF-L","フレームＬ+斜材",10.7,359,null,null,null,null,null,null,null,1078,"CP20","建枠連結ピン",0.6,2061,"ｸｲﾏﾙ1.5","くい丸１．５ｍ",4,3039,"MSI2C","Ｍサポート用クランプ",1.8,3181,"OKA-R","アジャストトラス　右",null,4083,"SXBP09","採光防音パネル09",5.2,5146,"BM1551G","メッシュシート",4.4000000000000004,6067,"CB2","キャッチベース",9,6281,"AL6M","アルミ梯子６Ｍ",15.1,6502,"ﾄﾞｰﾑ　4M","採光ドーム４M",null,null,null,null,null,9021,3012,"メタルホーム",11.5]
[23,"A4517S","簡昜枠",10.7,125,"ALHT-N5","アルミハッチ付布板",11.4,261,"ALAF-R","フレームＲ+斜材",10.7,360,"FSJ-1","Ｆ支柱抜止ピン",null,530,"JFX-06","先行手摺筋違0610",3.6,1079,"A20ﾊﾞﾗ","連結ピン（バラピン）",0.6,2062,"ｸｲﾏﾙ1.1","くい丸１．１ｍ",3.6,3040,"MSO1C","Ｍサポート用クランプ",1.8,3182,"OKA-L","アジャストトラス　左",null,4084,"SXBP06","採光防音パネル06",3.4,5147,"BM1251G","メッシュシート",3.5,6068,"CB3","キャッチベース",9.5,6282,"AL6MS","アルミ２連梯子６Ｍ",19.2,6503,"ﾄﾞｰﾑ4M　ﾂｳﾛ","採光ドーム４M通路",null,null,null,null,null,9022,3009,"メタルホーム",8.8000000000000007]
[24,"A6112S","簡昜枠",0,126,"ALHT-H","アルミハッチ用梯子",4,262,"ALA18A","万能板受け（上）１８",4.5999999999999996,361,"FSJ-2","インナーロックピン",null,531,"JFX-09","先行手摺筋違0914",4.3,1080,"A100","連結ピン",0,null,null,null,null,3041,"MSO2C","Ｍサポート用クランプ",1.9,3183,"OKA-P","アジャストポスト",null,null,null,null,null,5148,"BM0951G","メッシュシート",2.6,6071,"M18","鉄馬",5,6283,"ＥＡＳＹＣＭ","イージークライマー",4.0999999999999996,6504,"ｳﾜﾔﾊﾟﾈﾙ4MK","上屋パネル４M開口",410,null,null,null,null,9023,3006,"メタルホーム",6.1]
[25,null,null,null,127,"NSH1700","垂直梯子",9.1,263,"ALA18B","万能押え１８２９",1.8,362,"CL30-OS","連結クランプ",0.7,532,"JFX-12","先行手摺筋違1219",5.0999999999999996,1081,"A20","連結ピン",0.6,null,null,null,null,3046,"CHI50","強力サポート（上管）",41.6,3184,"OKPB-6","調節ピン",null,5001,"A5×5N","安全ネット５ｍ*５ｍ",6.3,5149,"BM0751G","メッシュシート",2.1,6072,"M18S","スプリング鉄馬",10,6284,"SITA31","下さんｏｒ手摺 １８２９",1.8,6505,"ｳﾜﾔﾊﾟﾈﾙ8MK","上屋パネル８M開口",788,null,null,null,null,9024,2018,"メタルホーム",13.5]
[26,"A205","610調整枠 H1524",10.7,128,"SRTS","垂直梯子上段手摺",5,264,"ALA18D","万能板受け（下）１８",5,363,null,null,null,533,"JFX-15","先行手摺筋違1524",5.9,1082,"PCC","Ｃジョイント",0.74,null,null,null,null,3047,"CHI40","強力サポート（上管）",30,3185,"OKP-9","接続ピン",null,5002,"A6×6N","安全ネット６ｍ*６ｍ",9,5150,"BM0651G","メッシュシート",1.8,6073,"LBﾏｯﾄ","コンクリートマット",6.7,6285,"SITA32","下さんｏｒ手摺 １５２４",1.5,6506,"RB２ｶﾞﾀ","ルーフビーム２ｍ",100,7249,"ｳﾝﾊﾟﾝﾌﾟﾚｰﾄ","上屋運搬プレート",2,9025,2015,"メタルホーム",11.3]
[27,"A204","610調整枠 H1219",11.7,129,"HT-N6","鋼製ハッチ付布板",25,265,"ALA18C","振れ止め１８２９",2.1,364,null,null,null,534,"JFX-18","先行手摺筋違1829",6.8,1083,"PCJ","直線ジョイント 48.6⇔48.6",0.6,2066,"KK-1.5","鋼製杭１．５ｍ",4.2,3048,"CHI32","強力サポート（上管）",21.2,3186,"OKSP-9","スナップピン",null,5003,"A5×10N","安全ネット５ｍ*１０ｍ",12.5,5151,"BM1851BE","メッシュ（ベージュ）",5.3,6074,"ｽｷﾏｲﾀ４５０","隙間板４５０ｘ４５０",5,6286,"SITA29","下さんｏｒ手摺 １２１９",1.2,6507,"ﾄﾘﾂｹﾌﾟﾚｰﾄ","取付プレート",null,7250,"300H-12M","３００Ｈ型鋼１２ｍ",1128,9026,2012,"メタルホーム",9.1]
{"$rows_left_out":69}